TRAK Metamodel
type: Ontology
preferred namespace prefix: trak
description: Description of the elements that form part of the metamodel for the open source TRAK architecture framework or which are used to describe or define it. The source document for these is 'TRAK00002. TRAK. Architecture Framework. Metamodel'.The Architecture Description Elements and relationships are used to define Architecture Description Tuples which form the basis of the specification of each of the TRAK Viewpoints and the consistency/correspondence rules across a TRAK-conforming Architecture Description.Architecture Description Tuples form the content of each TRAK Architecture View. Abstract concepts/entities cannot appear in a TRAK Architecture View but are used to manage or define other elements or model/describe them (metamodelling).
subject: trak
subject: architecture description
subject: architecture framework
subject: metamodel
subject: open source
subject: vocabulary
subject: vocabulary description
creator: https://orcid.org/0000-0003-3058-5022
contributor: https://orcid.org/0000-0003-3058-5022
publisher: https://orcid.org/0000-0003-3058-5022
license: fdl.html
access rights: The TRAK metamodel and its description is released under the GNU Gree Documentation License
rights holder: https://orcid.org/0000-0003-3058-5022
source: TRAK metamodel.pdf
repository: trunk
created with: neo4j-graph-database
created with: pycharm
created: 2010-02-15
issued: 2010-02-15
modified: 2025-12-17
version info: 2025-12-17
generated at time: 2026-03-03T18:08:00
version IRI: https://purl.org/trak/metamodel/vocab/2025-12-17
bibliographic citation: 'TRAK00004. TRAK. Architecture Framework.' https://sourceforge.net/projects/trak/files/TRAK_Overall.pdf
bibliographic citation: 'TRAK00001. TRAK. Architecture Framework. Viewpoints.' https://sourceforge.net/projects/trakviewpoints/files/TRAK_ArchitectureViewpoints.pdf
bibliographic citation: eng2.12168
bibliographic citation: N. Plum, ‘Using directed graphs to define viewpoints to keep a metamodel, an architecture framework and views using different modeling languages consistent’, Engineering Reports, vol. 2, no. 6, p. e12168, June 2020, doi: 10.1002/eng2.12168.
bibliographic citation: N. Plum, ‘Architecture Description Viewpoints. Metamodel Description, Implementation and Model Changes’, Eclectica Systems Ltd, 3736126–001, Sept. 2025. https://www.researchgate.net/publication/335176248_Architecture_Description_Viewpoints_Metamodel_Description_Implementation_and_Model_Changes.
bibliographic citation: https://doi.org/10.13140/RG.2.2.14037.99049/3

Architecture Description
type: Class
definition: IEEE 1471: An architectural description is a model of the architecture; its purpose is to answer all identified stakeholder's questions about all identified architecture-related concerns for the system of interest; The collection of architecture products that describes a system of interest.
comment: The purists will not like it (self-references / infinite recursion) but it provides a useful means for describing the scope/results for an architectural task using the MV-02 Architecture Design Record.
created: 2010-02-15
modified: 2025-04-30
subclass of: Architecture Description Element
subclass of: Architecture Product
subclass of: DCMI Artefact

Architecture Description Element
type: Class
definition: An individual architecture description object that is used to describe or represent an item of real-world architecture. An architecture description element can appear in an architecture description.
comment: The parent of all TRAK elements used in ADs.The intent of the attributes is to capture identification and ownership to allow bi-directional exchange of ADs between 2 organisations.Not used in any TRAK architecture view.
created: 2010-02-15
modified: 2015-09-05

Architecture Description Tuple
type: Class
definition: A named architecture description element connected by a named relationship to a named architecture description element. i.e. subject - predicate - object - the basis of a sentence.
comment: Smallest unit of architecture description in TRAK. Basis for natural language and machine understandable such as RDF. Not used in any TRAK architecture view – only the Architecture Description Elements that form a tuple.
created: 2010-02-15
modified: 2011-01-18

Architecture Framework
type: Class
definition: ISO/IEC/IEEE 42010 'conventions, principles and practices for the description of architectures established within a specific do- main of application and/or community of stakeholders.'
comment: Not used in any TRAK architecture view.
created: 2010-02-15
modified: 2015-07-23

Architecture Perspective
type: Class
definition: IEEE 1471 refers to an Architectural Perspective as 'Sharing of architectural models also facilitates an "aspect-oriented" style of architectural description' i.e. a grouping of related and overlapping architectural views.
comment: Not used in any TRAK architecture view.
created: 2010-02-15
modified: 2010-02-15

Architecture Product
type: Class
definition: A work product / artefact with architectural modelling content.
comment: Abstract - Not used in any TRAK architecture view. It is part of the background definition of TRAK.
created: 2010-02-15
modified: 2015-07-23

Architecture Task
type: Class
definition: A task which results in the delivery of one or more architecture products.
comment: Used on the MV-02 to describe the task for which the AD is produced - and to plan / organise the use/development of the models.
created: 2010-02-15
modified: 2025-04-30
subclass of: Architecture Description Element

Architecture View
type: Class
definition: ISO/IEC/IEEE 42010: A representation of a whole system from the perspective of a related set of concerns.
comment: Used in the MV-02 Architecture Design record.
created: 2010-02-15
modified: 2016-12-16
subclass of: Architecture Description Element
subclass of: Architecture Product
subclass of: DCMI Artefact

Architecture Viewpoint
type: Class
definition: A viewpoint defines a set of conventions (notations, languages and model types) for constructing a certain kind of view.
comment: Not used in any TRAK architecture view.
created: 2010-02-15
modified: 2020-04-10
subclass of: Architecture Product
subclass of: DCMI Artefact

Argument
type: Class
definition: A connected series of statements or reasons intended to establish a position (and, hence, to refute the opposite); a process of reasoning; argumentation.
created: 2014-12-24
modified: 2015-07-23
subclass of: Architecture Description Element

Capability
type: Class
definition: The ability to undertake a particular kind of action or the extent of someone's or something's ability.
comment: keep shortuse active (doing) voice should be able to be re-used easily across ADs / models
created: 2010-02-15
modified: 2011-01-27
subclass of: Architecture Description Element

Claim
type: Class
definition: That which is claimed. To claim - To assert and demand recognition of i.e. something which is asserted.
created: 2014-12-24
modified: 2020-04-10
subclass of: Architecture Description Element

Competence
type: Class
definition: The scope of knowledge or ability.
comment: important for human factors or human resources analysis
created: 2010-02-15
modified: 2021-12-21
subclass of: Architecture Description Element

Concept Activity
type: Class
definition: A high level logical activity or process which is independent of how the activity is carried out i.e. no 'how'.
comment: If Node is too like a real thing then Concept Activity is likely to be indistinguishable from a solution Function associated with a resource.
created: 2010-02-15
modified: 2011-01-27
subclass of: Architecture Description Element

Concern
type: Class
definition: An interest in a subject held by one or more stakeholder Human Resource.
comment: This is allied to ISO/IEC/IEEE 42010 where generic concerns are addressed through an Architecture Viewpoint (a specification for an Architecture View). Individual Architecture Views address specific concerns.
created: 2010-02-15
modified: 2021-12-21
subclass of: Architecture Description Element

Contract
type: Class
definition: A written or spoken agreement. between at least 2 parties that is intended to be enforceable by law.
comment: Used in the MV-03 Requirements & Standards View.
created: 2010-02-15
modified: 2025-04-30
subclass of: Architecture Description Element
subclass of: DCMI Artefact

DCMI Artefact
type: Class
definition: Abstract artefact
comment: Abstract. Used for inheritance of attributes.Not used in any TRAK architecture view.
created: 2024-09-23
modified: 2024-09-23

Document
type: Class
definition: A document artefact - a piece of written, printed, or electronic matter that provides information or evidence or that serves as an official record.
created: 2010-02-15
modified: 2016-12-05
subclass of: Architecture Description Element
subclass of: DCMI Artefact

Enterprise
type: Class
definition: An organisation - often a collection - having common goals of "bottom line". Also represents a period or duration within the total life of the bigger Enterprise.
created: 2010-02-15
modified: 2024-05-21
subclass of: Architecture Description Element

Enterprise Goal
type: Class
definition: An objective or target for an Enterprise (phase). i.e. it has an associated period or notion of phasing and is likely to be different or change between Enterprise Phases.
comment: A Vision (Statement) outlines what the organisation wants to be. It concentrates on the future. It is a source of inspiration. It provides clear decision- making criteria. [Wikipedia].A Mission Statement tells you the fundamental purpose of the organisation. It concentrates on the present. In TRAK therefore if an Enterprise is defined as having both the start and finish dates as [Today] and an Enterprise Goal is attached this is the equivalent to a Mission Statement.
created: 2010-02-15
modified: 2015-07-23
subclass of: Architecture Description Element

Event
type: Class
definition: Anything that happens, or is contemplated as happening; an incident, occurrence.
comment: An accident sequence is a sequence of events.
created: 2015-12-12
modified: 2025-04-30
subclass of: Architecture Description Element

Evidence
type: Class
definition: Testimony or facts tending to prove or disprove any conclusion or something serving as a proof.
comment: In TRAK evidence takes the form of a document artefact which can therefore include any type of media. Evidence identification captures identifies statement(s) that offer proof and define artefact as evidence.
created: 2014-12-24
modified: 2015-09-05
subclass of: Architecture Description Element
subclass of: DCMI Artefact

Function
type: Class
definition: An activity which is specified in context of the resource (human or machine) that performs it.
comment: .
created: 2010-02-15
modified: 2024-05-21
subclass of: Architecture Description Element
subclass of: Safety Monitored Element

Human Resource
type: Class
definition: Human organisational asset.
comment: AbstractParent class of Organisation, Role, Job.Not used in any TRAK architecture view.
created: 2010-02-15
modified: 2011-09-30
subclass of: Architecture Description Element
subclass of: Resource

Interaction Element
type: Class
definition: A formalised representation of the thing that is exchanged between Resources.
created: 2010-02-15
modified: 2011-02-11
subclass of: Architecture Description Element

Item
type: Class
definition: A high level quantity or thing that can flow.
comment: It is important to note that this isn't just information - it might be a materiel / resource flow, energy or data.
created: 2010-02-15
modified: 2011-02-11
subclass of: Architecture Description Element

Item Exchange
type: Class
definition: A solution-agnostic/logical exchange of an Item (data, resource, energy) between two entities
comment: The Item Exchange flows in the opposite direction to the direction of need. Labelled using 'from/to'
created: 2010-02-15
modified: 2015-07-23
subclass of: Architecture Description Element

Job
type: Class
definition: A position of employment - usually but not always paid.
created: 2010-02-15
modified: 2021-12-21
equivalent class: Post
subclass of: Human Resource

Metamodel
type: Class
definition: 'Metamodeling' is the construction of a collection of "concepts" (things, terms, etc.) within a certain domain. A model is an abstraction of phenomena in the real world; a metamodel is yet another abstraction, highlighting properties of the model itself. A model conforms to its metamodel in the way that a computer program conforms to the grammar of the programming language in which it is written.
comment: Not used in any TRAK architecture view.
created: 2010-02-15
modified: 2010-10-17
subclass of: Architecture Product

Metric
type: Class
definition: A measure.
comment: Allows taxonomies of metrics to be prepared and metrics to be shared.
created: 2010-02-15
modified: 2021-12-21
subclass of: Architecture Description Element

Milestone
type: Class
definition: Event marking a significant change or stage in development.
created: 2010-02-15
modified: 2021-12-21
subclass of: Architecture Description Element

Mitigation
type: Class
definition: The action of reducing the severity, seriousness, or painfulness of something.
created: 2015-12-12
modified: 2015-12-12
subclass of: Architecture Description Element

Need
type: Class
definition: A necessity or requirement for (something).
comment: labelled using 'has' ... Need ...'for'A Need may be defined using one or more Requirements as part of a normative document (Standard).
created: 2010-02-15
modified: 2021-12-22
subclass of: Architecture Description Element

Node
type: Class
definition: A node is a logical operational entity. It can represent anything from a command or signalling centre to a big system or organisational or co-ordinating body providing that no knowledge of how things are done is implied.
created: 2010-02-15
modified: 2021-12-21
subclass of: Architecture Description Element

Organisation
type: Class
definition: An organised body of people, associated for a particular purpose.
created: 2010-02-15
modified: 2021-12-21
equivalent class: Organization
subclass of: Human Resource

Physical
type: Class
definition: A physical thing. Can represent an equipment (which can host Software), a building or civil item, train etc.
comment: Note that there is a difference between a HQ - the building and a HQ as an Organisational Resource (which is housed in the building).
created: 2010-02-15
modified: 2021-12-21
subclass of: Resource

Port
type: Class
definition: A socket or opening (logical or physical) provided by a thing.
created: 2010-02-15
modified: 2021-12-22
subclass of: Architecture Description Element

Port Connection
type: Class
definition: Asserts that a connection exists between two ports.
comment: labelled using 'from/to'
created: 2010-02-15
modified: 2014-12-20
subclass of: Architecture Description Element

Project
type: Class
definition: An individual or collaborative enterprise that is carefully planned and designed to achieve a particular aim.
created: 2010-02-15
modified: 2021-12-22
subclass of: Architecture Description Element

Project Activity
type: Class
definition: An activity undertaken within a project which results in something being delivered.
comment: The use of Project Activity (with Project) in the architecture enables the architecture to represent snapshots or change in architecture with time. It enables a view to show what capability is delivered at a point in time (& compared with another, say, now).
created: 2010-02-15
modified: 2011-01-27
subclass of: Architecture Description Element

Protocol
type: Class
definition: A set of rules governing the exchange procedure between things.
created: 2010-02-15
modified: 2021-12-22
subclass of: Architecture Description Element

Requirement
type: Class
definition: An atomic requirement or constraint - a statement of need.
comment: It is NOT a requirements document. It is intended to represent a requirement - something that might be exported from a requirement management tool. It can be associated with any architecture element inside the boxed area.This provides a mechanism to associate requirements with model elements Desirable - Freedom e.g 'may'Desirable - Commitment e.g. 'will' Mandatory e.g.'shall'
created: 2010-02-15
modified: 2023-09-09
subclass of: Architecture Description Element

Resource
type: Class
definition: Part of the solution - a generic thing that refers to human-related and machine-related entities.
comment: Abstract.Parent class of System, Physical, Software, Human Resource.Not used in any TRAK architecture view.
created: 2010-02-15
modified: 2016-07-02
subclass of: Architecture Description Element
subclass of: Safety Monitored Element

Resource Interaction
type: Class
definition: A formalised representation of the thing exchanged between Resource.
comment: Can be a flow of data, energy or resource (Physical, Human Resource, System, Software) labelled using 'from/to'
created: 2010-02-15
modified: 2024-05-21
subclass of: Architecture Description Element

Risk
type: Class
definition: An uncertain event that has a harmful impact or consequence.
comment: When we refer to a 'risk' we usually mean a 'risky event'. If a Risk (event) is 100% certain to occur it is not a risk – it is an Event.
created: 2015-12-12
modified: 2012-12-12
subclass of: Event

Role
type: Class
definition: The duties or status assumed or part played by a person or organisation.
comment: If a single role occupies most of a job-holder’s time it may result in the job being redefined around the role.
created: 2010-02-15
modified: 2021-12-22
equivalent class: Role
equivalent class: BFO_0000023
subclass of: Human Resource

Safety Monitored Element
type: Class
definition: Something that has possible safety-related attributes
comment: Enables Safety Integrity Level (SIL) to be captured if appropriate.Abstract.Applied to Resource and to Function.Not used in any TRAK architecture view.
created: 2010-10-20
modified: 2017-01-28

Software
type: Class
definition: The programs and other operating information used by a computer.
created: 2010-02-15
modified: 2023-05-23
subclass of: Resource

Standard
type: Class
definition: A normative document. It is a formal document that establishes criteria, processes, practices or defines protocols. Note that although it is a form of Requirement it only applies through the application of a Requirement whether a contractual or technical.
comment: Used in the MV-03 Standards View.
created: 2010-02-15
modified: 2015-09-05
subclass of: Architecture Description Element
subclass of: DCMI Artefact

System
type: Class
definition: A composite structure exhibiting emergent behaviour.
comment: Can consist of purely human elements.A system is stable and maintains itself this way - the constituent parts must therefore collectively provide the mechanism to keep the system stable. If an essential part of a system is removed it destroys that system (it might become a different system because the system boundary is then different). As ever “the whole is more than the sum of the parts”
created: 2010-02-15
modified: 2017-01-28
subclass of: Resource

Threat
type: Class
definition: Something that has the potential to cause harm; danger; peril.
comment: Synonym for Hazard
created: 2015-12-12
modified: 2021-12-22
subclass of: Architecture Description Element

Vulnerability
type: Class
definition: A weakness or susceptibility.
created: 2015-12-12
modified: 2015-12-12
subclass of: Architecture Description Element

Zone
type: Class
definition: A definite region or area of the earth, or of any place or space, distinguished from adjacent regions.
created: 2021-12-22
modified: 2021-12-22
narrower: BFO_0000006
subclass of: Architecture Description Element

AND
type: ObjectProperty
type: SymmetricProperty
definition: Logical conjunction; the and of a set of operands is true if and only if all of its operands are true.
created: 2015-12-12
modified: 2016-01-01
equivalent property: Q191081
subclass of: Architecture Description Element

NOT
type: ObjectProperty
type: SymmetricProperty
definition: In logic, negation, also called logical complement, is an operation that takes a proposition p to another proposition "not p", which is interpreted intuitively as being true when p is false and false when p is true.
created: 2015-12-12
modified: 2016-01-01
equivalent property: Q190558
subclass of: Architecture Description Element

OR
type: ObjectProperty
type: SymmetricProperty
definition: Logical (inclusive) disjunction , also known as alternation; the or of a set of operands is true if and only if one or more of its operands is true.
created: 2015-12-12
modified: 2016-01-01
equivalent property: Q1651704
subclass of: Architecture Description Element

about
type: ObjectProperty
definition: On the subject of.
created: 2010-02-15
modified: 2015-07-23
subclass of: Architecture Description Element

addresses
type: ObjectProperty
type: TransitiveProperty
definition: Directs attention, frames for particular audience.
created: 2010-02-15
modified: 2021-12-22
subclass of: Architecture Description Element

allows
type: ObjectProperty
type: TransitiveProperty
definition: Sanctions or permits.
comment: Not used in any TRAK architecture view. Used to define the additional contextual content for a TRAK Architecture Viewpoint using the non-TRAK 'Viewpoint Definition Viewpoint'. Forms the basis of the 'Optional Tuples' section of the architecture viewpoint. Used with 'requires at least' to define architecture view content.Source 3736126-001
created: 2010-03-12
modified: 2021-12-22

applies
type: ObjectProperty
type: TransitiveProperty
definition: Bring or put into operation or practical use.
created: 2010-02-15
modified: 2021-12-22
subclass of: Architecture Description Element

aspires to
type: ObjectProperty
type: TransitiveProperty
definition: Ambition for something, seeks to obtain.
created: 2010-02-15
modified: 2021-12-22
subclass of: Architecture Description Element

before
type: ObjectProperty
definition: At, in, or to a time earlier than (a point in time, a date, or an event)
comment: Not used in any TRAK architecture view. Used to define the content of a TRAK architecture viewpoint - Viewpoint Definition Viewpoint - ordering rule.Source 3736126-001
created: 2024-05-21
modified: 2024-05-21

can lead to exposure to
type: ObjectProperty
definition: Potential to uncover or make visible to.
created: 2015-12-12
modified: 2015-12-12
subclass of: Architecture Description Element

carries
type: ObjectProperty
definition: Conveys or transfers.
created: 2010-02-15
modified: 2021-12-22
subclass of: Architecture Description Element

caused by
type: ObjectProperty
type: TransitiveProperty
definition: The cause of; effects, brought about by.
created: 2015-12-12
modified: 2016-01-01
subclass of: Architecture Description Element

conducts
type: ObjectProperty
definition: Directs, manages, carries on.
created: 2010-02-15
modified: 2021-12-22
subclass of: Architecture Description Element

contains
type: ObjectProperty
type: TransitiveProperty
definition: Have or hold something within.
comment: Transitive.Note - if Physical contains System or Physical it contains the 'parts' of the System/Physical.
created: 2012-12-06
modified: 2021-12-22
subclass of: Architecture Description Element

contributes to
type: ObjectProperty
definition: Has a part in bringing (it) about; has a part or share in producing.
created: 2015-12-12
modified: 2015-12-12
subclass of: Architecture Description Element

delivers
type: ObjectProperty
type: TransitiveProperty
definition: Provides or produces.
created: 2010-02-15
modified: 2021-12-22
subclass of: Architecture Description Element

depends on
type: ObjectProperty
type: TransitiveProperty
definition: Rely on. If A depends on B and B changes then it is likely that A changes in some way.
created: 2010-02-15
modified: 2021-12-22
subclass of: Architecture Description Element

derived from
type: ObjectProperty
type: TransitiveProperty
definition: Drawn, obtained, descended, or deduced from a source.
created: 2016-12-24
modified: 2016-12-24
subclass of: Architecture Description Element

enacts
type: ObjectProperty
definition: Put into practice.
created: 2010-02-15
modified: 2021-12-22
subclass of: Architecture Description Element

is equivalent to
type: ObjectProperty
type: TransitiveProperty
type: SymmetricProperty
definition: Having the same meaning or effect or being virtually identical to.
created: 2010-02-15
modified: 2021-12-22
subclass of: Architecture Description Element

exchanges
type: ObjectProperty
definition: Act of giving and receiving (between 2 entities).
created: 2010-02-15
modified: 2021-12-22
subclass of: Architecture Description Element

exploits
type: ObjectProperty
type: TransitiveProperty
definition: To utilize for the entity's own ends.
created: 2010-02-15
modified: 2021-12-22
subclass of: Architecture Description Element

exposed to
type: ObjectProperty
definition: Uncovered, made visible to
created: 2015-12-12
modified: 2024-05-21
subclass of: Architecture Description Element

exposes
type: ObjectProperty
definition: Uncover / make visible.
created: 2010-02-15
modified: 2021-12-22
subclass of: Architecture Description Element

extends to
type: ObjectProperty
type: TransitiveProperty
definition: Expand in scope to (a defined set of entities).
comment: Used to indicate the extent of a role.
created: 2010-02-15
modified: 2015-12-12
subclass of: Architecture Description Element

for
type: ObjectProperty
definition: Of purpose or destination.
created: 2010-02-15
modified: 2016-12-24
subclass of: Architecture Description Element

frames
type: ObjectProperty
type: TransitiveProperty
definition: To shape, form, direct (a person, a person's life, thoughts, actions, etc.);
comment: Not used in any TRAK architecture view. Used to define the concerns required to be addressed by the presented content of the governed architecture view. The architecture view conforms to its governing architecture viewpoint and hence this forms part of the definition of the architecture viewpoint 'Concerns Addressed\section. Defined using the non-TRAK 'Viewpoint Definition Viewpoint'.Source 3736126-001
created: 2023-05-26
modified: 2023-05-26

from
type: ObjectProperty
definition: Defines the origin of an exchange.
comment: Used to describe the direction of an exchange.
created: 2010-02-15
modified: 2024-05-21
subclass of: Architecture Description Element

governs
type: ObjectProperty
type: TransitiveProperty
definition: Constitutes a law or rule for.
created: 2010-02-15
modified: 2021-12-22
subclass of: Architecture Description Element

groups related
type: ObjectProperty
type: TransitiveProperty
definition: Brought together as the result of deliberate arrangement or composition - things having some related properties or attributes in common.
comment: Transitive.Not used in any TRAK architecture view. Used to define the structure of the TRAK architecture framework.
created: 2010-03-12
modified: 2010-03-12

has
type: ObjectProperty
type: TransitiveProperty
definition: Duty or obligation to.
created: 2010-02-15
modified: 2015-07-23
subclass of: Architecture Description Element

has part
type: ObjectProperty
type: TransitiveProperty
definition: Identifies a fraction or piece of something.
created: 2010-02-15
modified: 2024-05-21
equivalent property: hasPart
equivalent property: BFO_0000051
equivalent property: Property:P527
subclass of: Architecture Description Element

hosted on
type: ObjectProperty
type: TransitiveProperty
definition: Something provides space or an environment for the hosted entity. Not an exchange or interaction.
created: 2010-02-15
modified: 2024-05-21
subclass of: Architecture Description Element

impacts on
type: ObjectProperty
definition: Has a (pronounced) effect on.
created: 2015-12-12
modified: 2015-12-12
subclass of: Architecture Description Element

implements
type: ObjectProperty
type: TransitiveProperty
definition: Put into effect.
created: 2010-02-15
modified: 2021-12-22
subclass of: Architecture Description Element

is a
type: ObjectProperty
type: TransitiveProperty
definition: Membership of a more general type e.g. a rose is a plant. Used to identify inheritance / taxonomy.
created: 2010-02-15
modified: 2015-07-23
subclass of: Architecture Description Element

is attached to
type: ObjectProperty
type: TransitiveProperty
definition: To fasten or join (a thing) to another thing, or a place or position.
created: 2018-01-31
modified: 2018-01-31
equivalent property: RO_0002371
subclass of: Architecture Description Element

is configured with
type: ObjectProperty
definition: Put together in particular form or arrangement.
created: 2010-02-15
modified: 2021-12-22
subclass of: Architecture Description Element

is managed by
type: ObjectProperty
type: TransitiveProperty
definition: Controlled, directed or to deal or cope with.
created: 2015-12-12
modified: 2015-12-12
subclass of: Architecture Description Element

is member of
type: ObjectProperty
definition: Belonging to or having membership of (a group of organisations organized for a joint purpose). Distinct from is part of which implies a whole/part relationship.
created: 2010-02-15
modified: 2017-10-02
equivalent property: RO_0002350
subclass of: Architecture Description Element

is necessary for
type: ObjectProperty
type: TransitiveProperty
definition: Required for or need for.
created: 2010-02-15
modified: 2021-12-22
subclass of: Architecture Description Element

is not suited to frame
type: ObjectProperty
definition: Not suitable or appropriate to direct, shape or form
comment: Not used in any TRAK architecture view. Architecture Viewpoint definition - Viewpoint Definition Viewpoint - used to define an 'anti Concern'.Source 3736126-001
created: 2024-05-21
modified: 2024-05-21

is origin for
type: ObjectProperty
definition: That from which anything originates, or is derived; source of being or existence; starting point.
comment: Not used in any TRAK architecture view. Used in the non-TRAK 'Viewpoint Definition Viewpoint' to define the Architecture View that is the origin for one or more triples - termed the 'Master Architecture View' for those triples. The originating architecture view then 'supplies' the triples to architecture views created afterwards that present the triples.Source 3736126-001
created: 2024-06-25
modified: 2024-06-25

is party to
type: ObjectProperty
definition: Any of the groups of people constituting a side in a formal proceeding, such as the litigants in a legal action, those who enter into a contract, etc
created: 2025-04-30
modified: 2025-04-30
subclass of: Architecture Description Element

is quantified by
type: ObjectProperty
type: TransitiveProperty
definition: Express or measure using.
created: 2010-02-15
modified: 2015-07-23
subclass of: Architecture Description Element

issued by
type: ObjectProperty
definition: Supplied/distributed by.
created: 2010-02-15
modified: 2021-12-22
subclass of: Architecture Description Element

makes
type: ObjectProperty
type: TransitiveProperty
definition: Creates, prepares or produces.
created: 2014-12-24
modified: 2021-12-22
subclass of: Architecture Description Element

marked by
type: ObjectProperty
definition: Show the position of.
created: 2010-02-15
modified: 2021-12-22
subclass of: Architecture Description Element

marks introduction of
type: ObjectProperty
definition: The position or time at which (something) is brought into use or started.
created: 2010-02-15
modified: 2015-07-23
subclass of: Architecture Description Element

marks removal of
type: ObjectProperty
definition: The position or time at which (something) is removed from use or finished.
created: 2010-02-15
modified: 2015-07-23
subclass of: Architecture Description Element

owns
type: ObjectProperty
type: TransitiveProperty
definition: Possesses (denotes belonging).
created: 2010-02-15
modified: 2023-07-30
subclass of: Architecture Description Element

performs
type: ObjectProperty
type: TransitiveProperty
definition: To carry out one's function, to do one's part; to do, act.
created: 2010-02-15
modified: 2021-12-22
subclass of: Architecture Description Element

physically supports
type: ObjectProperty
type: TransitiveProperty
definition: To keep from falling.
created: 2018-01-31
modified: 2018-01-31
subclass of: Architecture Description Element

plays
type: ObjectProperty
type: TransitiveProperty
definition: Takes part or engages in.
created: 2010-02-15
modified: 2024-05-21
subclass of: Architecture Description Element

poses
type: ObjectProperty
type: TransitiveProperty
definition: To present or constitute (a difficulty, problem, danger, or threat)
created: 2015-12-12
modified: 2015-12-12
subclass of: Architecture Description Element

precedes
type: ObjectProperty
type: TransitiveProperty
definition: Comes before (something) in time.
created: 2011-01-27
modified: 2021-12-22
equivalent property: BFO_0000063
subclass of: Architecture Description Element

presents
type: ObjectProperty
type: TransitiveProperty
definition: Exhibits or displays.
comment: Not used in any TRAK architecture view. Used to define the presented content for a TRAK Architecture View using the non-TRAK 'View Dependency Viewpoint'.Source 3736126-001
created: 2010-03-12
modified: 2024-02-08

realises
type: ObjectProperty
type: TransitiveProperty
definition: Give physical form to.
created: 2010-02-15
modified: 2021-12-22
subclass of: Architecture Description Element

removes
type: ObjectProperty
type: TransitiveProperty
definition: Take away.
created: 2010-02-15
modified: 2021-12-22
subclass of: Architecture Description Element

requires
type: ObjectProperty
type: TransitiveProperty
definition: Needs or demands for a particular purpose.
created: 2010-02-15
modified: 2024-05-21
equivalent property: requires
subclass of: Architecture Description Element

requires at least
type: ObjectProperty
type: TransitiveProperty
definition: Obligation for no less than something.
comment: Not used in any TRAK architecture view. Used to define the core content for a TRAK Architecture Viewpoint using the non-TRAK 'Viewpoint Definition Viewpoint'. Forms the basis of minimum allowed set of tuples - well-formedness. Used with 'allows' to define architecture view content.Source 3736126-001
created: 2024-05-21
modified: 2024-05-21

results in
type: ObjectProperty
definition: Effects; the product or consequences of something.
created: 2015-12-12
modified: 2024-05-21
subclass of: Architecture Description Element

satisfies
type: ObjectProperty
type: TransitiveProperty
definition: Fulfil completely or comply with.
created: 2017-10-02
modified: 2017-10-02
equivalent property: conformsTo
subclass of: Architecture Description Element

starts with
type: ObjectProperty
definition: To take or assume as one's point of departure in a sequence
comment: Not used in any TRAK architecture view. Used with ...'then' to define the starting element for a TRAK metamodel tuple formed from multiple consecutive triples using the non-TRAK 'Metamodel Tuple Definition Viewpoint'.Source 3736126-001
created: 2024-05-21
modified: 2024-05-21
equivalent property: RO_0002224

supersedes
type: ObjectProperty
type: TransitiveProperty
definition: Take place of something previously in force.
created: 2010-02-15
modified: 2015-07-23
subclass of: Architecture Description Element

supplied to
type: ObjectProperty
definition: Provided with (a thing). Inverse of 'supplies'.
comment: Not used in any TRAK architecture view. Used with ...'supplies' to define the destination or receiving architecture view in the nominal supply of a TRAK metamodel tuple between architecture views using the non-TRAK 'View Dependency Viewpoint'.Source 3736126-001
created: 2024-05-21
modified: 2024-05-21

supplies
type: ObjectProperty
type: TransitiveProperty
definition: To provide (a thing) with what is necessary or desirable; to provide what is needed.
comment: Not used in any TRAK architecture view. Used with ...'supplied to' to define the source architecture view in the nominal supply of a TRAK metamodel tuple between architecture views using the non-TRAK 'View Dependency Viewpoint'.Source 3736126-001
created: 2024-05-21
modified: 2024-05-21

then
type: ObjectProperty
definition: At the moment immediately following the action, etc. directly after that;, indicating the action or occurrence next in order of time
comment: Not used in any TRAK architecture view. Used with ...'starts with' to define the starting element for a TRAK metamodel tuple formed from multiple consecutive triples using the non-TRAK 'Metamodel Tuple Definition Viewpoint'.Source 3736126-001
created: 2024-05-21
modified: 2024-05-21

to
type: ObjectProperty
definition: Defines the destination or target of an exchange.
comment: Used to describe the direction of an exchange.
created: 2010-02-15
modified: 2015-07-23
subclass of: Architecture Description Element

to conduct
type: ObjectProperty
definition: To direct, manage, carry on.
created: 2010-02-15
modified: 2015-07-23
subclass of: Architecture Description Element

traces to
type: ObjectProperty
type: TransitiveProperty
definition: Marks the source for something.
created: 2010-02-15
modified: 2021-12-22
subclass of: Architecture Description Element

triggers
type: ObjectProperty
type: TransitiveProperty
definition: Cause to happen or exist.
created: 2010-02-15
modified: 2021-12-22
subclass of: Architecture Description Element

undertakes
type: ObjectProperty
type: TransitiveProperty
definition: Commit to / take on.
created: 2010-02-15
modified: 2021-12-22
subclass of: Architecture Description Element

uses
type: ObjectProperty
type: TransitiveProperty
definition: To put into action or effect.
created: 2010-02-15
modified: 2021-12-22
subclass of: Architecture Description Element

AD exchange element owning ID
type: DatatypeProperty
definition: The unique identifier for the architectural element belonging to the AD element owning organisation.
created: 2010-02-15
modified: 2024-02-08
range: string
domain: Architecture Description Element

AD exchange element owning organisation
type: DatatypeProperty
definition: The name of the owning organisation of the architectural description element.
created: 2010-02-15
modified: 2024-02-08
range: string
domain: Architecture Description Element

AD exchange element recipient ID
type: DatatypeProperty
definition: The unique identifier for the architectural description element belonging to the organisation receiving the architectural description element.
created: 2010-03-16
modified: 2024-02-08
range: string
domain: Architecture Description Element

AD exchange element recipient element name
type: DatatypeProperty
definition: The name of the architectural description element in the recipient organisation.
created: 2010-03-16
modified: 2024-02-08
range: string
domain: Architecture Description Element

AD exchange element recipient organisation
type: DatatypeProperty
definition: The name of the organisation receiving the architectural description element.
created: 2010-03-16
modified: 2024-02-08
range: string
domain: Architecture Description Element

AD exchange element reference URL
type: DatatypeProperty
definition: A URL that provides information on the architectural description element
created: 2010-02-15
modified: 2024-05-21
range: anyURI
domain: Architecture Description Element

DCMI contributor
type: DatatypeProperty
definition: An entity responsible for making contributions to the content of the resource.
created: 2010-03-12
modified: 2011-09-30
range: string
domain: DCMI Artefact
equivalent property: contributor

DCMI creator
type: DatatypeProperty
definition: An entity primarily responsible for making the content of the resource.
created: 2010-03-12
modified: 2011-09-30
range: string
domain: DCMI Artefact
equivalent property: maker
equivalent property: creator

DCMI format
type: DatatypeProperty
definition: The physical or digital manifestation of the resource.
created: 2011-09-30
modified: 2011-09-30
range: string
domain: DCMI Artefact
equivalent property: format

DCMI identifier
type: DatatypeProperty
definition: An unambiguous reference to the resource within a given context.
created: 2010-03-12
modified: 2011-09-30
range: string
domain: DCMI Artefact
equivalent property: identifier

DCMI language
type: DatatypeProperty
definition: A language of the intellectual content of the resource.
created: 2010-03-12
modified: 2011-09-30
range: string
domain: DCMI Artefact
equivalent property: language

DCMI publisher
type: DatatypeProperty
definition: The entity responsible for making the resource available.
created: 2010-03-12
modified: 2011-09-30
range: string
domain: DCMI Artefact
equivalent property: publisher

DCMI source
type: DatatypeProperty
definition: A Reference to a resource from which the present resource is derived.
created: 2010-03-12
modified: 2011-09-30
range: string
domain: DCMI Artefact
equivalent property: source

DCMI source type
type: DatatypeProperty
definition: The nature or genre of the content of the resource.
created: 2010-03-12
modified: 2011-09-30
range: string
domain: DCMI Artefact
equivalent property: DCMIType

DCMI subject
type: DatatypeProperty
definition: The topic of the content of the resource.
created: 2010-03-12
modified: 2011-09-30
range: string
domain: DCMI Artefact
equivalent property: subject

DCMI title
type: DatatypeProperty
definition: A name by which the resource is formally known.
created: 2010-02-15
modified: 2011-09-30
range: string
domain: DCMI Artefact
equivalent property: title

DCMI type
type: DatatypeProperty
definition: The nature or genre of the content of the resource.
created: 2010-03-12
modified: 2011-09-30
range: string
domain: DCMI Artefact
equivalent property: DCMIType

approval authority
type: DatatypeProperty
definition: The approval authority for the architecture description.
created: 2010-02-15
modified: 2024-05-21
range: string
domain: Architecture Description

architect
type: DatatypeProperty
definition: The names(s) of the architect(s) who produced the architecture description i.e. the authors.
created: 2010-02-15
modified: 2010-02-15
range: string
domain: Architecture Description

argument identifier
type: DatatypeProperty
definition: A unique identifier for an argument.
created: 2015-05-23
modified: 2015-07-23
range: string
domain: Argument

artefact url
type: DatatypeProperty
definition: The URL of the actual document being represented by this element.
created: 2024-09-23
modified: 2024-09-23
range: anyURI
domain: DCMI Artefact

assessment
type: DatatypeProperty
definition: The evaluation text / narrative.
created: 2015-05-23
modified: 2024-05-21
range: string
domain: disproves
domain: opposes
domain: proves
domain: supports

assessment result
type: DatatypeProperty
definition: The conclusion / result of the evaluation.
created: 2015-09-05
modified: 2024-05-21
range: string
domain: disproves
domain: opposes
domain: proves
domain: supports

assumptions
type: DatatypeProperty
definition: Any assumptions made, any constraints or limitations that apply to the analysis or the task for which the architecture description is produced.
created: 2010-02-15
modified: 2015-09-05
range: string
domain: Architecture Description

claim identifier
type: DatatypeProperty
definition: A unique identifier for a claim.
created: 2015-05-23
modified: 2015-07-23
range: string
domain: Claim

closed date
type: DatatypeProperty
definition: The date at which the Concern was closed
created: 2010-02-15
modified: 2010-02-15
range: date
domain: Concern

closure action
type: DatatypeProperty
definition: The action taken to close the Concern.
created: 2015-05-23
modified: 2015-07-23
range: string
domain: Concern

compliance level claimed
type: DatatypeProperty
definition: Degree of level of conformance or compliance claimed against a Contract, Requirement or Standard.
created: 2015-09-05
modified: 2024-05-21
range: string
domain: Claim

compliance level required
type: DatatypeProperty
definition: Indicates the level of compliance needed against the stated requirement.
created: 2015-09-07
modified: 2015-09-07
range: string
domain: Requirement

concern identifier
type: DatatypeProperty
definition: Unique identifier for the Concern.
created: 2015-05-23
modified: 2015-07-23
range: string
domain: Concern

concern scope
type: DatatypeProperty
definition: The scope or type of Concern.
created: 2010-02-15
modified: 2024-05-21
range: string
domain: Concern

concern status
type: DatatypeProperty
definition: The status of the Concern.
created: 2010-02-15
modified: 2024-05-21
range: string
domain: Concern

concerns addressed
type: DatatypeProperty
definition: The (stakeholder) concerns addressed by the viewpoint.
created: 2012-01-02
modified: 2024-05-21
range: string
domain: Architecture Viewpoint

consistency rules
type: DatatypeProperty
definition: Rules that apply to AD elements in order to keep the Architecture Description consistent.
created: 2012-01-02
modified: 2012-01-02
range: string
domain: Architecture Viewpoint

constraints
type: DatatypeProperty
definition: Any restrictions, limitations or exclusions that apply to the analysis or the task for which the architecture description is produced.
created: 2010-02-15
modified: 2015-09-05
range: string
domain: Architecture Description

date created
type: DatatypeProperty
definition: Date on which AD element created.
created: 2015-09-05
modified: 2015-09-05
range: date
domain: Architecture Description Element
equivalent property: created

date modified
type: DatatypeProperty
definition: Date on which AD element modified.
created: 2015-09-05
modified: 2015-09-05
range: date
domain: Architecture Description Element
equivalent property: modified

decisions
type: DatatypeProperty
definition: Any decisions made during the architecture task.
created: 2015-09-05
modified: 2024-05-21
range: string
domain: Architecture Description

dependency type
type: DatatypeProperty
definition: Type or descriptor for the dependency.
created: 2011-08-20
modified: 2011-08-20
range: string
domain: physically depends on

physically depends on
type: ObjectProperty
type: TransitiveProperty
definition: A physical dependency between two entities.
created: 2010-02-15
modified: 2015-07-23
subclass of: Architecture Description Element

description
type: DatatypeProperty
definition: A description of the architecture element being represented by the architecture description element.
created: 2010-02-15
modified: 2011-04-08
range: string
domain: Architecture Description Element
equivalent property: description

element URI
type: DatatypeProperty
definition: The Uniform Resource Identifier for the architectural element itself (i.e. not a reference).
created: 2011-02-03
modified: 2011-02-03
range: anyURI
domain: Architecture Description Element

element author
type: DatatypeProperty
definition: The name of the creator of the AD element.
created: 2015-09-05
modified: 2024-05-21
range: string
domain: Architecture Description Element
equivalent property: creator

element type
type: DatatypeProperty
definition: Type of element.
created: 2010-02-15
modified: 2016-12-24
range: string
domain: Interaction Element

event identifier
type: DatatypeProperty
definition: The likelihood or chance of occurrence.
created: 2025-04-30
modified: 2025-04-30
range: string
domain: Event

evidence definition
type: DatatypeProperty
definition: Identification of the statements that identifies the artefact as the evidence (supporting the argument(s) and claim(s) identified.)
created: 2014-12-24
modified: 2015-09-05
range: string
domain: Evidence

evidence identifier
type: DatatypeProperty
definition: Unique identifier assigned to evidence architecture description element.
created: 2015-07-23
modified: 2015-07-23
range: string
domain: Evidence

exchange type
type: DatatypeProperty
definition: Type of element.
created: 2010-02-15
modified: 2016-12-24
range: string
domain: Item Exchange
domain: Resource Interaction

finish date
type: DatatypeProperty
definition: The end date or date of completion.
created: 2010-02-15
modified: 2010-02-15
range: date
domain: Architecture Task
domain: Contract
domain: Enterprise
domain: Project Activity

geographic extent
type: DatatypeProperty
definition: The area that the element occupies.
created: 2016-07-02
modified: 2024-05-21
domain: Resource
domain: Zone

identifier
type: DatatypeProperty
definition: Unique identifier for the Resource.
created: 2010-02-15
modified: 2024-05-21
range: string
domain: Resource

impact severity
type: DatatypeProperty
definition: A measure of the impact on something.
created: 2015-12-12
modified: 2020-04-10
range: string
domain: Event

impact severity ranking
type: DatatypeProperty
definition: Label indicating ranking of the impact on something.
created: 2020-04-10
modified: 2020-04-10
range: string
domain: Event

interface authority
type: DatatypeProperty
definition: The organisation responsible for the definition / management of the interface.
created: 2014-12-20
modified: 2014-12-20
range: string
domain: Port Connection
domain: Resource Interaction

issue
type: DatatypeProperty
definition: Issue identifier
created: 2010-02-15
modified: 2024-05-21
range: string
domain: DCMI Artefact

issue date
type: DatatypeProperty
definition: A date associated with the issue of the resource.
created: 2010-02-15
modified: 2024-05-21
range: date
domain: DCMI Artefact
equivalent property: created

issuing organisation
type: DatatypeProperty
definition: The name of the organisation that formally releases the document.
created: 2010-02-15
modified: 2024-05-27
range: string
domain: DCMI Artefact

item exchange identifier
type: DatatypeProperty
definition: Unique identifier for the Item Exchange.
created: 2010-02-15
modified: 2016-12-24
range: string
domain: Item Exchange

item type
type: DatatypeProperty
definition: Type of Item.
created: 2010-02-15
modified: 2016-12-24
range: string
domain: Item

job holder name
type: DatatypeProperty
definition: The name of the person who holds the job.
created: 2010-04-15
modified: 2010-04-15
range: string
domain: Job

location
type: DatatypeProperty
definition: The location of the Resource (latitude, longitude, altitude).
created: 2010-02-20
modified: 2024-05-21
domain: Resource
domain: Zone
equivalent property: centroid

location code
type: DatatypeProperty
definition: A sequence of numbers, characters, symbols that identifies a location e.g. post code.
created: 2010-02-15
modified: 2024-05-27
range: string
domain: Resource

location label
type: DatatypeProperty
definition: A text label for the location. Descriptive, not necessarily unique.
created: 2012-01-02
modified: 2012-01-02
range: string
domain: Resource

master architecture view
type: DatatypeProperty
definition: The name / identifier of the architecture view that first declares an AD element or an Architecture Description Tuple.
created: 2011-09-30
modified: 2024-05-27
range: string
domain: Architecture Viewpoint

name
type: DatatypeProperty
definition: Name of the architecture description element
created: 2011-04-08
modified: 2011-04-08
range: string
domain: Architecture Description Element

need identifier
type: DatatypeProperty
definition: Unique identifier for the Need.
created: 2010-02-15
modified: 2011-08-20
range: string
domain: Need

need type
type: DatatypeProperty
definition: Type of Need.
created: 2010-02-15
modified: 2011-09-30
range: string
domain: Need

network location
type: DatatypeProperty
definition: Position of Resource in network e.g. sequence or topology
created: 2015-07-23
modified: 2015-07-23
range: string
domain: Resource

opened date
type: DatatypeProperty
definition: The date at which the Concern was opened (raised).
created: 2010-02-15
modified: 2010-02-15
range: date
domain: Concern

optional tuples
type: DatatypeProperty
definition: The Architecture Description Tuples that may be added to an Architecture View to provide context or clarity.
created: 2011-09-30
modified: 2011-09-30
range: string
domain: Architecture Viewpoint

organisation identifier
type: DatatypeProperty
definition: Identifier for an organisation.
created: 2023-07-30
modified: 2023-07-30
range: string
domain: Organisation

part
type: DatatypeProperty
definition: The identifier of the part.
created: 2010-02-15
modified: 2024-05-21
range: string
domain: Standard

path length
type: DatatypeProperty
definition: The length of a path measured in units of triples ("hops").
created: 2024-09-23
modified: 2024-09-23
domain: Architecture Description Tuple

perspective description
type: DatatypeProperty
definition: Description of the Architecture Perspective.
created: 2010-02-15
modified: 2010-02-15
range: string
domain: Architecture Perspective

perspective identifier
type: DatatypeProperty
definition: Unique identifier for Architecture Perspective.
created: 2010-02-15
modified: 2015-09-05
range: string
domain: Architecture Perspective

perspective title
type: DatatypeProperty
definition: Short title for the Architecture Perspective.
created: 2010-02-15
modified: 2010-02-15
range: string
domain: Architecture Perspective
equivalent property: title

pm codeword
type: DatatypeProperty
definition: A codeword is another mechanism to limit distribution - only those with the need to know and the codeword have access to the protectively marked information.
created: 2012-01-02
modified: 2024-05-21
range: string
domain: Architecture Description Element

pm commercial
type: DatatypeProperty
definition: Commercial privacy marking.
created: 2012-01-02
modified: 2015-09-05
range: string
domain: Architecture Description Element

pm descriptor
type: DatatypeProperty
definition: A qualifier used with the protective marking to denote the type of information, sensitivity or need to protect.
created: 2012-01-02
modified: 2015-09-05
range: string
domain: Architecture Description Element

pm marking
type: DatatypeProperty
definition: A protective marking - used to indicate the severity or impact of the loss of the item marked.
created: 2012-01-02
modified: 2015-09-05
range: string
domain: Architecture Description Element

pm marking owner
type: DatatypeProperty
definition: The entity who has the authority to sanction decide, release or lower the protective marking classification.
created: 2012-01-02
modified: 2024-05-27
range: string
domain: Architecture Description Element

pm national caveat
type: DatatypeProperty
definition: A restriction of the audience who can see the element by nationality e.g. 'UK EYES ONLY' would restrict the potential audience to UK nationals.
created: 2012-01-02
modified: 2012-01-02
range: string
domain: Architecture Description Element

port connection identifier
type: DatatypeProperty
definition: Unique identifier for the Port Connection.
created: 2011-08-20
modified: 2016-12-24
range: string
domain: Port Connection

port identifier
type: DatatypeProperty
definition: Unique identifier for the Port.
created: 2010-02-15
modified: 2015-09-05
range: string
domain: Port

priority
type: DatatypeProperty
definition: Priority attached to the Concern.
created: 2010-02-15
modified: 2024-05-21
range: string
domain: Concern

probability
type: DatatypeProperty
definition: The likelihood or chance of occurrence.
created: 2015-12-12
modified: 2025-04-30
domain: Event

purpose
type: DatatypeProperty
definition: The purpose for which the architecture description is produced. This should reference the task stakeholder(s) and concerns.
created: 2010-02-15
modified: 2024-05-21
range: string
domain: Architecture Description

raised by organisation
type: DatatypeProperty
definition: The organisation that created the Concern.
created: 2010-02-15
modified: 2024-05-27
range: string
domain: Concern
narrower: creator

rationale
type: DatatypeProperty
definition: A reasoned exposition of principles; an explanation or statement of reasons; (also) an (attempted) justification for something. [OED]
created: 2015-05-23
modified: 2015-05-23
range: string
domain: Architecture Description Element

recommendations
type: DatatypeProperty
definition: Any recommendations that result from the architecture task and consequent analysis.
created: 2010-02-15
modified: 2024-05-21
range: string
domain: Architecture Description

requirement identifier
type: DatatypeProperty
definition: The unique identifier for the atomic requirement e.g 'ABC123456'
created: 2010-02-15
modified: 2010-02-15
range: string
domain: Requirement

requirement owner
type: DatatypeProperty
definition: The entity that has rightful claim or title to the requirement.
created: 2011-04-08
modified: 2024-05-27
range: string
domain: Requirement

requirement paragraph
type: DatatypeProperty
definition: The paragraph number of the requirement. e.g. '3.2.4'
created: 2010-02-15
modified: 2011-04-08
range: string
domain: Requirement

requirement priority
type: DatatypeProperty
definition: The priority attached to the requirement.
created: 2010-02-15
modified: 2024-05-21
range: string
domain: Requirement

requirement scope
type: DatatypeProperty
definition: The product scope of the thing to which the requirement applies.
created: 2010-02-15
modified: 2024-05-27
range: string
domain: Requirement
broader: subject

requirement text
type: DatatypeProperty
definition: The requirement text
created: 2010-02-15
modified: 2024-05-21
range: string
domain: Requirement

requirement title
type: DatatypeProperty
definition: Brief label or summary of the requirement.
created: 2010-02-15
modified: 2024-05-27
range: string
domain: Requirement
equivalent property: title

requirement type
type: DatatypeProperty
definition: The type of requirement.
created: 2010-02-15
modified: 2023-09-09
range: string
domain: Requirement

resource interaction identifier
type: DatatypeProperty
definition: Unique identifier for the Resource Interaction
created: 2011-08-20
modified: 2011-08-20
range: string
domain: Resource Interaction

safety integrity level
type: DatatypeProperty
definition: An indicator of the degree of risk reduction required for the element.
created: 2010-02-15
modified: 2010-02-15
domain: Safety Monitored Element

sequence identifier
type: DatatypeProperty
definition: Position in sequence of requirement statements
created: 2015-05-23
modified: 2024-05-21
range: string
domain: Requirement

software type
type: DatatypeProperty
definition: Purpose or level of architectural abstraction of the software.
created: 2023-05-26
modified: 2023-05-26
range: string
domain: Software

start date
type: DatatypeProperty
definition: The date marking the beginning or start.
created: 2010-02-15
modified: 2010-02-15
range: date
domain: Architecture Task
domain: Contract
domain: Enterprise
domain: Project Activity

subject tuples
type: DatatypeProperty
definition: The Architecture Description Tuples that are required for a well-formed Architecture View.
created: 2024-05-27
modified: 2024-05-27
range: string
domain: Architecture Viewpoint

submission date
type: DatatypeProperty
definition: The date on which the related architecture description element was submitted for assessment.
created: 2014-12-24
modified: 2015-05-23
range: date
domain: disproves
domain: opposes
domain: proves
domain: supports

disproves
type: ObjectProperty
type: TransitiveProperty
definition: Demonstrate not to be the specified thing by evidence or argument.
comment: Transitive.The submission / assessment is for a (particular) Evidence disproves (particular) Claim. The same Evidence may be used for other Claims - this is a separate submission / assessment.
created: 2014-12-24
modified: 2024-05-21
subclass of: Architecture Description Element

opposes
type: ObjectProperty
type: TransitiveProperty
definition: Dispute the truth or validity of.
created: 2014-12-24
modified: 2021-12-22
subclass of: Architecture Description Element

proves
type: ObjectProperty
type: TransitiveProperty
definition: Asserts that the source element establishes a fact or the truth of the object of the relationship.
comment: Transitive.The submission / assessment is for a (particular) Evidence proves (particular) Claim. The same Evidence may be used for other Claims - this is a separate submission / assessment.
created: 2014-12-24
modified: 2015-09-05
subclass of: Architecture Description Element

supports
type: ObjectProperty
type: TransitiveProperty
definition: Give assistance to / enable to function or act.
created: 2010-02-15
modified: 2024-05-21
subclass of: Architecture Description Element

summary of findings
type: DatatypeProperty
definition: A summary of the findings made during the architecture description task.
created: 2010-02-15
modified: 2010-02-15
range: string
domain: Architecture Description
equivalent property: abstract

title
type: DatatypeProperty
definition: An inscription placed on or over an object, giving its name or describing it; a legend.
created: 2010-02-15
modified: 2024-05-21
range: string
domain: Concern
equivalent property: title

tools used
type: DatatypeProperty
definition: Identifies the tools and methods used in the construction of the architecture description and analysis of it.
created: 2010-02-15
modified: 2010-02-15
range: string
domain: Architecture Description

tuple identifier
type: DatatypeProperty
definition: A unique identifier for an Architecture Description Tuple.
created: 2010-02-15
modified: 2010-02-15
range: string
domain: Architecture Description Tuple

verification method
type: DatatypeProperty
definition: The method used to establish that the requirement subject satisfies the requirement.
created: 2023-05-26
modified: 2023-05-26
range: string
domain: Requirement

view description
type: DatatypeProperty
definition: Description of the content of the architecture view.
created: 2010-02-15
modified: 2015-09-05
range: string
domain: Architecture View

view element identifier
type: DatatypeProperty
definition: Unique identifier for the architecture view represented (if this is a separate element)
created: 2015-09-05
modified: 2015-09-05
range: string
domain: Architecture View

view identifier
type: DatatypeProperty
definition: The identifier - text or number short-code - for the architecture view e.g. CV-01
created: 2010-02-15
modified: 2010-02-15
range: string
domain: Architecture View

view title
type: DatatypeProperty
definition: The title of the architecture view e.g. Solution Function
created: 2010-02-15
modified: 2010-02-15
range: string
domain: Architecture View
equivalent property: title

viewpoint description
type: DatatypeProperty
definition: Description of the Architecture Viewpoint.
created: 2010-02-15
modified: 2016-12-24
range: string
domain: Architecture Viewpoint
equivalent property: description

viewpoint identifier
type: DatatypeProperty
definition: Unique identifier for the Architecture Viewpoint.
created: 2010-02-15
modified: 2015-09-05
range: string
domain: Architecture Viewpoint

viewpoint title
type: DatatypeProperty
definition: Title of the Architecture Viewpoint.
created: 2010-02-15
modified: 2010-02-15
range: string
domain: Architecture Viewpoint
equivalent property: title

views needed
type: DatatypeProperty
definition: The Architecture Views that must first be created to declare the AD element(s) needed for the Architecture View that responds to this Architecture Viewpoint.
created: 2011-09-30
modified: 2011-09-30
range: string
domain: Architecture Viewpoint

vocabulary uri
type: DatatypeProperty
definition: The URI that identifies the semantic definition of the TRAK metamodel element (a type).The value is invariant and linked to a central TRAK vocabulary e.g. https://purl.org/trak/elements/#Resource_Interaction.A URI is an identifier consisting of a hierarchical sequence of components referred to as the scheme, authority, path, query, and fragment.
created: 2025-12-17
modified: 2025-12-17
range: anyURI
domain: Architecture Description Element

well formedness
type: DatatypeProperty
definition: Minimum acceptable content for an Architecture View in terms of Architecture Description Tuples.
created: 2015-09-05
modified: 2015-09-05
range: string
domain: Architecture Viewpoint

withdrawal date
type: DatatypeProperty
definition: The date at which the artefact is withdrawn and is then no longer in effect.
created: 2010-02-15
modified: 2024-05-27
range: date
domain: Standard

Accepted
type: Thing
type: NamedIndividual
definition: The classified element has been recognized as correct or valid.
domain: assessment result
created: 2015-09-05
modified: 2024-05-21

Alignment
type: Thing
type: NamedIndividual
definition: Identifies that 2 elements have a dependency between them based on the physical orientation of one element with respect to the other.
domain: dependency type
created: 2011-08-20
modified: 2011-08-20

Analysis
type: Thing
type: NamedIndividual
definition: A method involving systematic investigation in order to explain or understand something.
domain: verification method
created: 2023-06-03
modified: 2023-06-03

Application
type: Thing
type: NamedIndividual
definition: Software designed to carry out a specific task other than one relating to the operation of the computer itself; application programs regarded collectively.
domain: software type
created: 2023-05-26
modified: 2023-05-26

Architecture
type: Thing
type: NamedIndividual
definition: The classified element applies to the real world architecture itself.
domain: concern scope
created: 2010-02-20
modified: 2010-02-20

Architecture Description
type: Thing
type: NamedIndividual
definition: The classified element applies to the description of the architecture.
domain: concern scope
created: 2010-02-20
modified: 2010-02-20

Architecture Framework
type: Thing
type: NamedIndividual
definition: The classified element applies to the architecture framework used.
domain: concern scope
created: 2010-02-20
modified: 2010-02-20

Architecture Task
type: Thing
type: NamedIndividual
definition: The classified element applies to the task delivering the architecture description.
domain: concern scope
created: 2010-02-20
modified: 2021-12-22

Budget
type: Thing
type: NamedIndividual
definition: The classified element relates to proposed or actual measures for a financial budget.
domain: pm descriptor
created: 2010-03-16
modified: 2010-03-16

Closed
type: Thing
type: NamedIndividual
definition: Identifies that any activity associated with the element has stopped.
domain: concern status
created: 2010-02-20
modified: 2024-05-21

Collection
type: Thing
type: NamedIndividual
definition: Denotes an aggregation of resources.
domain: DCMI type
created: 2010-02-15
modified: 2012-01-02

Commercial
type: Thing
type: NamedIndividual
definition: The classified element applies to commerce or business.
domain: pm descriptor
domain: requirement type
created: 2010-03-16
modified: 2010-03-16

Commercial In Confidence
type: Thing
type: NamedIndividual
definition: The classified element contains information that if released may prejudice the business dealings of a party e.g. prices, discounts, rebates, profits, methodologies and process information.
domain: pm commercial
created: 2010-04-15
modified: 2010-03-16

Commercial In Secret
type: Thing
type: NamedIndividual
definition: The classified element contains information that constitutes a trade secret, posession of which information provides a competitive advantage.
domain: pm commercial
created: 2012-01-02
modified: 2024-06-25

Confidential
type: Thing
type: NamedIndividual
definition: The classified element contains information where compromise could materially damage diplomatic relations (e.g. protest, sanction); prejudice individual security or liberty; damage the operational effectiveness or security of the UK, allied forces or intelligence operations; nwork substantially against national finances or economic and commercial interests; impede the investigation of a crime; facilitate the commission of a crime; breach information confidentiality; substantially undermine the financial viability of major organisations; seriously impede the development or operation of major government policies; shut down or substantially disrupt significant national operations. ['HMG Security Policy Framework', Cabinet Office Government Security Secretariat (GSS), 23-Oct-2013. Version 11.0].
domain: pm marking
created: 2010-03-16
modified: 2010-03-16

Constraint
type: Thing
type: NamedIndividual
definition: The classified element concerns a pre-existing restriction or something that is fixed or non-negotiable.
domain: requirement type
created: 2023-06-03
modified: 2023-06-03

Data
type: Thing
type: NamedIndividual
definition: The classified element is or contains data or information.
domain: element type
domain: exchange type
domain: item type
domain: need type
created: 2010-02-20
modified: 2010-02-20

Demonstration
type: Thing
type: NamedIndividual
definition: A basic confirmation of performance capability or operation, differentiated from testing by the lack of detailed data gathering. Demonstrations can involve the use of physical models or mock-ups.
domain: verification method
created: 2023-05-26
modified: 2023-05-26

Desirable - Freedom
type: Thing
type: NamedIndividual
definition: Indicates that the requirement allows a freedom but is not mandatory.
domain: compliance level required
created: 2011-02-28
modified: 2015-09-07

Desirable - Intent
type: Thing
type: NamedIndividual
definition: Indicates that the requirement represents an intent but one that is not mandatory.
domain: compliance level required
created: 2024-06-25
modified: 2024-06-25

Driver
type: Thing
type: NamedIndividual
definition: Software that enables a computer to communicate with a particular piece of hardware or peripheral device. More fully device driver. Often with preceding word as audio driver, printer driver, etc.
domain: software type
created: 2023-05-26
modified: 2023-05-26

Embedded/Firmware
type: Thing
type: NamedIndividual
definition: A permanent form of software built into certain kinds of computer.
domain: software type
created: 2023-05-26
modified: 2023-05-26

Enabling
type: Thing
type: NamedIndividual
definition: The classified element supports or facilitates a product.
domain: requirement scope
created: 2011-04-08
modified: 2023-06-03

Energy
type: Thing
type: NamedIndividual
definition: The classified element is or contains a form of energy (the capacity to do work).
domain: element type
domain: exchange type
domain: item type
domain: need type
created: 2010-02-20
modified: 2010-02-20

Event
type: Thing
type: NamedIndividual
definition: Denotes a non-persistent, time-based occurrence associated with the classified element. Note: Whilst this is a valid DCMIType, the DCMI wording seems to define an artefact as an event which is not valid.
domain: DCMI type
created: 2010-02-15
modified: 2012-01-02

Full
type: Thing
type: NamedIndividual
definition: Identifies complete conformance or compliance with a requirement i.e. that the requirement is wholly met.
domain: compliance level claimed
created: 2015-09-05
modified: 2020-04-10

HR / Management
type: Thing
type: NamedIndividual
definition: The classified element contains information related to staff performance, well-being or personal data; for example, employment contracts, annual appraisals, or medical information.
domain: pm descriptor
created: 2024-06-25
modified: 2024-06-25

High
type: Thing
type: NamedIndividual
definition: The classified element has a value in the top-most range of values.
domain: impact severity ranking
domain: priority
domain: requirement priority
created: 2010-02-20
modified: 2010-02-21

Image
type: Thing
type: NamedIndividual
definition: The classified element is a visual representation other than text.
domain: DCMI type
created: 2010-02-15
modified: 2012-01-02

In Confidence
type: Thing
type: NamedIndividual
definition: The classified element contains information received under an air of confidence, the disclosure of which might be an actionable breach in law.
domain: pm descriptor
created: 2010-03-16
modified: 2010-03-16

In Strict Confidence
type: Thing
type: NamedIndividual
definition: The classified element contains information that has been disclosed to the recipient on the understanding that it will not be disclosed to any third party.
domain: pm commercial
created: 2012-01-02
modified: 2012-01-02

Inspection
type: Thing
type: NamedIndividual
definition: Careful examination, surveying or scrutiny of the element. Often physical e.g. measurement.
domain: verification method
created: 2023-06-03
modified: 2023-06-03

Interactive Resource
type: Thing
type: NamedIndividual
definition: The classified element is a resource requiring interaction from the user to be understood, executed, or experienced.
domain: DCMI type
created: 2010-02-15
modified: 2012-01-02

Interface
type: Thing
type: NamedIndividual
definition: The classified element applies to the interaction, exchange or connection between two (or more) things.
domain: requirement type
created: 2023-06-03
modified: 2023-06-03

Investigation
type: Thing
type: NamedIndividual
definition: The classified element contains information concerning disciplinary or criminal matters.
domain: pm descriptor
created: 2010-03-16
modified: 2010-03-16

Legal
type: Thing
type: NamedIndividual
definition: The classified element is or is related to a law or statutary requirements, to active or potential criminal or civil proceedings.
domain: pm descriptor
domain: requirement type
created: 2010-03-16
modified: 2010-03-16

Low
type: Thing
type: NamedIndividual
definition: The classified element has a value in the smallest range of values.
domain: impact severity ranking
domain: priority
domain: requirement priority
created: 2010-02-20
modified: 2024-05-21

Mandatory
type: Thing
type: NamedIndividual
definition: Identifies that compliance or conformance is compulsory.
domain: compliance level required
created: 2011-02-28
modified: 2015-09-07

Medical
type: Thing
type: NamedIndividual
definition: The classified element relates to medical reports, records and material relating to staff.
domain: pm descriptor
created: 2010-03-16
modified: 2010-03-16

Medium
type: Thing
type: NamedIndividual
definition: The classified element has a value in the middle range of values.
domain: impact severity ranking
domain: priority
domain: requirement priority
created: 2010-02-20
modified: 2015-09-05

Middleware
type: Thing
type: NamedIndividual
definition: Software that acts as a bridge between an operating system and applications, esp. among networked clients or a distributed system.
domain: software type
created: 2023-05-26
modified: 2023-05-26

Moving Image
type: Thing
type: NamedIndividual
definition: The classified element is a series of visual representations imparting an impression of motion when shown in succession.
domain: DCMI type
created: 2010-02-15
modified: 2012-01-02

N/A
type: Thing
type: NamedIndividual
definition: Not Applicable - the property does not apply to the element.
domain: assessment result
domain: compliance level claimed
domain: compliance level required
domain: safety integrity level
domain: verification method
created: 2015-09-05
modified: 2015-07-23

N/A - Heading
type: Thing
type: NamedIndividual
definition: The classified element is a heading.
domain: requirement type
created: 2023-09-09
modified: 2023-09-09

None
type: Thing
type: NamedIndividual
definition: Not any (one of a number of things. Not any other classifier applies. No part or amount of some thing.
domain: compliance level claimed
domain: pm commercial
domain: pm descriptor
created: 2020-04-10
modified: 2020-04-10

Not Protectively Marked
type: Thing
type: NamedIndividual
definition: The classified element contains information that requires a higher / more restrictive privacy marking. Compromise would result in little or no harm.
domain: pm marking
created: 2010-03-16
modified: 2010-03-16

Not Specified
type: Thing
type: NamedIndividual
definition: No classifier has been applied to the classified element.
domain: concern scope
domain: concern status
domain: impact severity ranking
domain: pm marking
domain: priority
domain: requirement priority
created: 2010-02-20
modified: 2010-02-21

Official
type: Thing
type: NamedIndividual
definition: The classified element contains information where compromise would cause no more than moderate damage.
domain: pm marking
created: 2024-06-25
modified: 2024-06-25

Open
type: Thing
type: NamedIndividual
definition: The classified element is exposed or available for inspection.
domain: concern status
created: 2010-02-15
modified: 2024-05-21

Operating System
type: Thing
type: NamedIndividual
definition: The low-level (low-level adj. 4b) software that supports a computer's basic functions, such as scheduling tasks, controlling peripherals, and allocating storage.An operating system is typically loaded automatically when a computer is switched on by means of a bootstrap routine. It provides the basic interface for the computer when no applications are running.
domain: software type
created: 2023-05-26
modified: 2023-05-26

Other
type: Thing
type: NamedIndividual
definition: Denotes that none of the other allowable classifiers are suitable to classify the element.
domain: requirement type
created: 2023-06-03
modified: 2023-06-03

Partial
type: Thing
type: NamedIndividual
definition: The classified element partially conforms or complies with the identified requirement i.e. that the requirement is not wholly met.
domain: compliance level claimed
created: 2015-09-05
modified: 2020-04-10

Performance
type: Thing
type: NamedIndividual
definition: The classified element concerns how well something is carried-out.
domain: requirement type
created: 2023-06-03
modified: 2023-06-03

Personal Data
type: Thing
type: NamedIndividual
definition: The classified element contains biographic data relating to an identifiable individual (e.g. name, address, D.O.B.) or Sensitive personal data as defined by section 2 of the Data Protection Act, including records relating to the criminal justice system, finances or group membership.
domain: pm descriptor
created: 2010-03-16
modified: 2010-03-16

Physical
type: Thing
type: NamedIndividual
definition: The classified element applies to physical characteristics.
domain: requirement type
created: 2023-06-03
modified: 2023-06-03

Policy & Strategy
type: Thing
type: NamedIndividual
definition: The classified element contains information information that forms part of a defined course of corporate action, plan or action to achieve a long term objective or procedure that is associated with internal use only.
domain: pm descriptor
created: 2010-03-16
modified: 2010-03-16

Product
type: Thing
type: NamedIndividual
definition: Relating to something that is developed, manufactured or refined, mass-produced and commercially marketed.
domain: requirement scope
created: 2011-04-08
modified: 2023-06-03

Protect
type: Thing
type: NamedIndividual
definition: The classified element contains information where compromise could cause distress to individuals; prejudice the investigation of a crime; facilitate the commission of a crime; breach information conidentiality; cause financial loss or loss of earning potential; provide unfair advantage for individuals or companies; disadvantage government in commercial or policy negotiations with others. ['HMG Security Policy Framework', Cabinet Office Government Security Secretariat (GSS), 23-Oct-2013. Version 11.0].
domain: pm marking
created: 2010-03-16
modified: 2010-03-16

Proximity
type: Thing
type: NamedIndividual
definition: Identifies that 2 elements have a dependency between them based on being physically near or close by in space.
domain: dependency type
created: 2011-08-20
modified: 2011-08-20

Rejected
type: Thing
type: NamedIndividual
definition: The classified element is not accepted and has been discarded.
domain: assessment result
created: 2015-09-05
modified: 2024-05-21

Resource
type: Thing
type: NamedIndividual
definition: The classified element is, contains or conveys a Resource i.e. Job, Organisation, Physical, Role, System or Software.
domain: element type
domain: exchange type
domain: item type
domain: need type
created: 2010-02-20
modified: 2011-08-20

Restricted
type: Thing
type: NamedIndividual
definition: The classified element contains information where compromise could adversely affect diplomatic relations; cause substantial distress to individuals; prejudice the investigation of a crime; facilitate the commission of a crime;breach information conidentiality; cause financial loss for individuals or companies; impede government policy operation. ['HMG Security Policy Framework', Cabinet Office Government Security Secretariat (GSS), 23-Oct-2013. Version 11.0].
domain: pm marking
created: 2010-03-16
modified: 2010-03-16

SIL1
type: Thing
type: NamedIndividual
definition: The classified element requires a Risk Reduction Factor of 10 to 100
domain: safety integrity level
created: 2010-02-20
modified: 2010-02-20

SIL2
type: Thing
type: NamedIndividual
definition: The classified element requires a Risk Reduction Factor of 100 to 1,000
domain: safety integrity level
created: 2010-02-20
modified: 2010-02-20

SIL3
type: Thing
type: NamedIndividual
definition: The classified element requires a Risk Reduction Factor of 1,000 to 10,000
domain: safety integrity level
created: 2010-02-20
modified: 2010-02-20

SIL4
type: Thing
type: NamedIndividual
definition: The classified element requires a Risk Reduction Factor of 10,000 to 100,000
domain: safety integrity level
created: 2010-02-20
modified: 2010-02-20

Secret
type: Thing
type: NamedIndividual
definition: The classified element contains information where where compromise could seriously damage military capabilities, international relations or the investigation of serious organised crime.
domain: pm marking
created: 2010-03-16
modified: 2010-03-16

Service
type: Thing
type: NamedIndividual
definition: The classified element provides abstract functionality.
domain: DCMI type
created: 2010-02-15
modified: 2012-01-02

Similarity
type: Thing
type: NamedIndividual
definition: The classified element is sufficiently similar to a different element and therefore the same arguments and evidence are applicable to the classified element.
domain: verification method
created: 2023-05-26
modified: 2023-05-26

Software
type: Thing
type: NamedIndividual
definition: The classified element is a computer program in source or compiled form.
domain: DCMI type
created: 2010-02-15
modified: 2012-01-02

Sound
type: Thing
type: NamedIndividual
definition: The classified element is a resource primarily intended to be heard.
domain: DCMI type
created: 2010-02-15
modified: 2012-01-02

Test
type: Thing
type: NamedIndividual
definition: Formal practical experiment with detailed evidential data gathering. May involve the execution of mathematical models or simulations.
domain: verification method
created: 2023-06-03
modified: 2023-06-03

Text
type: Thing
type: NamedIndividual
definition: The classified element is a resource consisting primarily of words for reading.
domain: DCMI type
created: 2010-02-15
modified: 2012-01-02

Top Secret
type: Thing
type: NamedIndividual
definition: The classified element contains information where compromise could cause widespread loss of life or else threaten the security or economic wellbeing of the country or friendly nations.
domain: pm marking
created: 2010-03-16
modified: 2010-03-16

Unknown
type: Thing
type: NamedIndividual
definition: The classified element has a classifier value that is not known.
domain: DCMI type
domain: assessment result
domain: compliance level claimed
domain: compliance level required
domain: dependency type
domain: element type
domain: exchange type
domain: item type
domain: need type
domain: requirement scope
domain: requirement type
domain: safety integrity level
domain: software type
domain: verification method
created: 2010-02-20
modified: 2012-01-02

application/json
type: Thing
type: NamedIndividual
definition: Multipurpose Internet Mail Extensions (MIME) type identifying a JavaScript Object Notation (JSON) text-based media type.
domain: DCMI format
created: 2015-09-05
modified: 2015-09-05

application/msword
type: Thing
type: NamedIndividual
definition: Multipurpose Internet Mail Extensions (MIME) type identifying a Microsoft Word media type.
domain: DCMI format
created: 2015-09-05
modified: 2015-09-05

application/pdf
type: Thing
type: NamedIndividual
definition: Multipurpose Internet Mail Extensions (MIME) type identifying a Portable Document Format media type. The PDF is based on the Postscript language.
domain: DCMI format
created: 2015-09-05
modified: 2015-09-05

application/rdf+xml
type: Thing
type: NamedIndividual
definition: Multipurpose Internet Mail Extensions (MIME) type identifying a Resource Description Framework (RDF) text-based media type.
domain: DCMI format
created: 2015-09-05
modified: 2015-09-05

application/trig
type: Thing
type: NamedIndividual
definition: Multipurpose Internet Mail Extensions (MIME) type identifying a Turtle Named Graph (RDF) media type.
domain: DCMI format
created: 2015-09-05
modified: 2015-09-05

application/vnd.openxmlformats-officedocument.wordprocessingml.document
type: Thing
type: NamedIndividual
definition: Multipurpose Internet Mail Extensions (MIME) type identifying an Open Office XML media type.
domain: DCMI format
created: 2015-09-05
modified: 2015-09-05

audio/mpeg
type: Thing
type: NamedIndividual
definition: Multipurpose Internet Mail Extensions (MIME) type identifying a device, platform and vendor-neutral audio media type.
domain: DCMI format
created: 2015-09-05
modified: 2015-09-05

audio/ogg
type: Thing
type: NamedIndividual
definition: Multipurpose Internet Mail Extensions (MIME) type identifying an Ogg media type. It is used to encode audio, video, text and metadata.
domain: DCMI format
created: 2015-09-05
modified: 2015-09-05

en
type: Thing
type: NamedIndividual
definition: ISO 639 language code. Denotes that the language is English.
domain: DCMI language
created: 2010-03-16
modified: 2010-03-16

es
type: Thing
type: NamedIndividual
definition: ISO 639 language code. Denotes that the language is Spanish.
domain: DCMI language
created: 2010-03-16
modified: 2010-03-16

fr
type: Thing
type: NamedIndividual
definition: ISO 639 language code. Denotes that the language is French.
domain: DCMI language
created: 2010-03-16
modified: 2010-03-16

image/bmp
type: Thing
type: NamedIndividual
definition: Multipurpose Internet Mail Extensions (MIME) type identifying a bitmap image (BMP) media type.
domain: DCMI format
created: 2015-09-05
modified: 2015-09-05

image/gif
type: Thing
type: NamedIndividual
definition: Multipurpose Internet Mail Extensions (MIME) type identifying a Graphics Interchange Format (GIF) media type.
domain: DCMI format
created: 2015-09-05
modified: 2015-09-05

image/jpeg
type: Thing
type: NamedIndividual
definition: Multipurpose Internet Mail Extensions (MIME) type identifying a Joint Photographic Experts (JPEG) File Interchange Format media type.
domain: DCMI format
created: 2015-09-05
modified: 2015-09-05

image/png
type: Thing
type: NamedIndividual
definition: Multipurpose Internet Mail Extensions (MIME) type identifying a Portable Network Graphic (PNG) media type.
domain: DCMI format
created: 2015-09-05
modified: 2015-09-05

image/svg+xml
type: Thing
type: NamedIndividual
definition: Multipurpose Internet Mail Extensions (MIME) type identifying a Scalable Vector Graphics (SVG) media type.
domain: DCMI format
created: 2015-09-05
modified: 2015-09-05

text/csv
type: Thing
type: NamedIndividual
definition: Multipurpose Internet Mail Extensions (MIME) type identifying a Comma Separated Variable (CSV) media type.
domain: DCMI format
created: 2015-09-05
modified: 2015-09-05

text/html
type: Thing
type: NamedIndividual
definition: Classifier. Multipurpose Internet Mail Extensions (MIME) type identifying a HyperText Markup Language (HTML) media type.
domain: DCMI format
created: 2015-09-05
modified: 2015-09-05

text/markdown
type: Thing
type: NamedIndividual
definition: Multipurpose Internet Mail Extensions (MIME) type identifying a Markdown markup language plain text media type.
domain: DCMI format
created: 2015-09-05
modified: 2015-09-05

text/plain
type: Thing
type: NamedIndividual
definition: Multipurpose Internet Mail Extensions (MIME) type identifying an plain text media type.
domain: DCMI format
created: 2015-09-05
modified: 2015-09-05

text/rtf
type: Thing
type: NamedIndividual
definition: Multipurpose Internet Mail Extensions (MIME) type identifying a Rich Text Format (RTF) media type.
domain: DCMI format
created: 2015-09-05
modified: 2015-09-05

text/tab-separated-values
type: Thing
type: NamedIndividual
definition: Multipurpose Internet Mail Extensions (MIME) type identifying an tab-separated-values (TSV) media type.
domain: DCMI format
created: 2015-09-05
modified: 2015-09-05

text/turtle
type: Thing
type: NamedIndividual
definition: Multipurpose Internet Mail Extensions (MIME) type identifying a Turtle (RDF) media type.
domain: DCMI format
created: 2015-09-05
modified: 2015-09-05

text/vcf
type: Thing
type: NamedIndividual
definition: Multipurpose Internet Mail Extensions (MIME) type identifying a Virtual Contact File 'vCard' (VCF) media type.
domain: DCMI format
created: 2015-09-05
modified: 2015-09-05

text/xml
type: Thing
type: NamedIndividual
definition: Multipurpose Internet Mail Extensions (MIME) type identifying an Extensible Markup Language (XML) text-based media type.
domain: DCMI format
created: 2015-09-05
modified: 2015-09-05

zh
type: Thing
type: NamedIndividual
definition: ISO 639 language code. Denotes that the language is Chinese.
domain: DCMI language
created: 2010-03-16
modified: 2010-03-16